Reaction Details
TargetP2Y purinoceptor 12
LigandBDBM50345265
Substrate/Competitorn/a
Meas. Tech.ChEMBL_752182 (CHEMBL1786558)
IC50 470±n/a nM
Citation Bach, PBoström, JBrickmann, Kvan Giezen, JJHovland, RPetersson, AURay, AZetterberg, F A novel series of piperazinyl-pyridine ureas as antagonists of the purinergic P2Y12 receptor. Bioorg Med Chem Lett21:2877-81 (2011) 
 
P2Y purinoceptor 12
Name:P2Y purinoceptor 12
Type:Enzyme
Mol. Mass.:39458.48
Organism:Homo sapiens (Human)
Description:Q9H244
Residue:342
BDBM50345265
NameBDBM50345265
Synonyms:CHEMBL1784220 | Ethyl 5-cyano-6-(4-{[(4-fluorobenzyl)amino]carbonyl}piperazin-1-yl)-2-(trifluoro-methyl)nicotinate
TypeSmall organic molecule
Emp. Form.C22H21F4N5O3
Mol. Mass.479.4275
SMILESCCOC(=O)c1cc(C#N)c(nc1C(F)(F)F)N1CCN(CC1)C(=O)NCc1ccc(F)cc1