Reaction Details
TargetUnconventional myosin-Va
LigandBDBM50345502
Substrate/Competitorn/a
Meas. Tech.ChEMBL_751031 (CHEMBL1786816)
IC50 1200±n/a nM
Citation Preller, MChinthalapudi, KMartin, RKnolker, HJManstein, DJ Inhibition of Myosin ATPase activity by halogenated pseudilins: a structure-activity study. J Med Chem54:3675-85 (2011) 
 
Unconventional myosin-Va
Name:Unconventional myosin-Va
Type:PROTEIN
Mol. Mass.:212421.50
Organism:Gallus gallus
Description:ChEMBL_751031
Residue:1829
BDBM50345502
NameBDBM50345502
Synonyms:CHEMBL1235156 | pentabromopseudilin
TypeSmall organic molecule
Emp. Form.C10H4Br5NO
Mol. Mass.553.665
SMILESOc1c(Br)cc(Br)cc1-c1[nH]c(Br)c(Br)c1Br