Reaction Details
TargetGlyceraldehyde-3-phosphate dehydrogenase, glycosomal
LigandBDBM50292429
Substrate/Competitorn/a
Meas. Tech.ChEMBL_749308 (CHEMBL1785089)
Ki 6000±n/a nM
Citation Pereira, JMSeverino, RPVieira, PCFernandes, JBda Silva, MFZottis, AAndricopulo, ADOliva, GCorrêa, AG Anacardic acid derivatives as inhibitors of glyceraldehyde-3-phosphate dehydrogenase from Trypanosoma cruzi. Bioorg Med Chem16:8889-95 (2008) 
 
Glyceraldehyde-3-phosphate dehydrogenase, glycosomal
Name:Glyceraldehyde-3-phosphate dehydrogenase, glycosomal
Synonyms:G3PG_TRYCR
Type:PROTEIN
Mol. Mass.:39070.68
Organism:Trypanosoma cruzi
Description:ChEMBL_973242
Residue:359
BDBM50292429
NameBDBM50292429
TypeSmall organic molecule
Emp. Form.C22H30O3
Mol. Mass.342.4718
SMILESOC(=O)c1c(O)cccc1CCCCCCC\C=C/C\C=C/CC=C