Reaction Details
TargetMetabotropic glutamate receptor 1
LigandBDBM50345955
Substrate/Competitorn/a
Meas. Tech.ChEMBL_749913 (CHEMBL1786743)
IC50 7.7±n/a nM
Citation Sasikumar, TKQiang, LBurnett, DAGreenlee, WJLi, CHeimark, LPramanik, BGrilli, MBertorelli, RLozza, GReggiani, A Tricyclic thienopyridine-pyrimidones/thienopyrimidine-pyrimidones as orally efficacious mGluR1 antagonists for neuropathic pain. Bioorg Med Chem Lett19:3199-203 (2009) 
 
Metabotropic glutamate receptor 1
Name:Metabotropic glutamate receptor 1
Type:Enzyme
Mol. Mass.:132358.19
Organism:Homo sapiens (Human)
Description:Q13255
Residue:1194
BDBM50345955
NameBDBM50345955
Synonyms:3-(4-Chloro-phenyl)-9-(2-methyl-allylamino)-3H-thieno[2,3-d:4,5-d']dipyrimidin-4-one | CHEMBL1784054
TypeSmall organic molecule
Emp. Form.C18H14ClN5OS
Mol. Mass.383.855
SMILESCC(=C)CNc1ncnc2sc3c(ncn(-c4ccc(Cl)cc4)c3=O)c12