Reaction Details
TargetMetabotropic glutamate receptor 5
LigandBDBM50345934
Substrate/Competitorn/a
Meas. Tech.ChEMBL_749915 (CHEMBL1786745)
IC50>3000±n/a nM
Citation Sasikumar, TKQiang, LBurnett, DAGreenlee, WJLi, CHeimark, LPramanik, BGrilli, MBertorelli, RLozza, GReggiani, A Tricyclic thienopyridine-pyrimidones/thienopyrimidine-pyrimidones as orally efficacious mGluR1 antagonists for neuropathic pain. Bioorg Med Chem Lett19:3199-203 (2009) 
 
Metabotropic glutamate receptor 5
Name:Metabotropic glutamate receptor 5
Type:Enzyme
Mol. Mass.:132484.72
Organism:Homo sapiens (Human)
Description:n/a
Residue:1212
BDBM50345934
NameBDBM50345934
Synonyms:9-Allylamino-3-(4-bromo-phenyl)-3H-pyrido[3',2':4,5]thieno[3,2-d]pyrimidin-4-one | CHEMBL1783861
TypeSmall organic molecule
Emp. Form.C18H13BrN4OS
Mol. Mass.413.291
SMILESBrc1ccc(cc1)-n1cnc2c(sc3nccc(NCC=C)c23)c1=O