Reaction Details
TargetMetabotropic glutamate receptor 5
LigandBDBM50345956
Substrate/Competitorn/a
Meas. Tech.ChEMBL_749915 (CHEMBL1786745)
IC50>3000±n/a nM
Citation Sasikumar, TKQiang, LBurnett, DAGreenlee, WJLi, CHeimark, LPramanik, BGrilli, MBertorelli, RLozza, GReggiani, A Tricyclic thienopyridine-pyrimidones/thienopyrimidine-pyrimidones as orally efficacious mGluR1 antagonists for neuropathic pain. Bioorg Med Chem Lett19:3199-203 (2009) 
 
Metabotropic glutamate receptor 5
Name:Metabotropic glutamate receptor 5
Type:Enzyme
Mol. Mass.:132484.72
Organism:Homo sapiens (Human)
Description:n/a
Residue:1212
BDBM50345956
NameBDBM50345956
Synonyms:9-(2-Methyl-allylamino)-3-p-tolyl-3H-thieno[2,3-d:4,5-d']dipyrimidin-4-one | CHEMBL1784055
TypeSmall organic molecule
Emp. Form.C19H17N5OS
Mol. Mass.363.436
SMILESCC(=C)CNc1ncnc2sc3c(ncn(-c4ccc(C)cc4)c3=O)c12