Reaction Details
TargetMetabotropic glutamate receptor 1
LigandBDBM50345922
Substrate/Competitorn/a
Meas. Tech.ChEMBL_749914 (CHEMBL1786744)
Ki 77±n/a nM
Citation Sasikumar, TKQiang, LBurnett, DAGreenlee, WJLi, CHeimark, LPramanik, BGrilli, MBertorelli, RLozza, GReggiani, A Tricyclic thienopyridine-pyrimidones/thienopyrimidine-pyrimidones as orally efficacious mGluR1 antagonists for neuropathic pain. Bioorg Med Chem Lett19:3199-203 (2009) 
 
Metabotropic glutamate receptor 1
Name:Metabotropic glutamate receptor 1
Type:Enzyme Catalytic Domain
Mol. Mass.:133240.47
Organism:RAT
Description:metabotropic glutamate 1/2 0 RAT::P23385
Residue:1199
BDBM50345922
NameBDBM50345922
Synonyms:3-(3-Fluoro-4-methoxy-phenyl)-9-prop-2-ynylamino-3H-thieno[2,3-d:4,5-d']dipyrimidin-4-one | CHEMBL1784071
TypeSmall organic molecule
Emp. Form.C18H12FN5O2S
Mol. Mass.381.384
SMILESCOc1ccc(cc1F)-n1cnc2c(sc3ncnc(NCC#C)c23)c1=O