Reaction Details
TargetMetabotropic glutamate receptor 1
LigandBDBM50345918
Substrate/Competitorn/a
Meas. Tech.ChEMBL_749914 (CHEMBL1786744)
Ki 4.4±n/a nM
Citation Sasikumar, TKQiang, LBurnett, DAGreenlee, WJLi, CHeimark, LPramanik, BGrilli, MBertorelli, RLozza, GReggiani, A Tricyclic thienopyridine-pyrimidones/thienopyrimidine-pyrimidones as orally efficacious mGluR1 antagonists for neuropathic pain. Bioorg Med Chem Lett19:3199-203 (2009) 
 
Metabotropic glutamate receptor 1
Name:Metabotropic glutamate receptor 1
Type:Enzyme Catalytic Domain
Mol. Mass.:133240.47
Organism:RAT
Description:metabotropic glutamate 1/2 0 RAT::P23385
Residue:1199
BDBM50345918
NameBDBM50345918
Synonyms:3-(4-Chloro-phenyl)-9-prop-2-ynylamino-3H-thieno[2,3-d:4,5-d']dipyrimidin-4-one | CHEMBL1784067
TypeSmall organic molecule
Emp. Form.C17H10ClN5OS
Mol. Mass.367.812
SMILESClc1ccc(cc1)-n1cnc2c(sc3ncnc(NCC#C)c23)c1=O