Reaction Details
TargetMetabotropic glutamate receptor 1
LigandBDBM50345948
Substrate/Competitorn/a
Meas. Tech.ChEMBL_749914 (CHEMBL1786744)
Ki 1.6±n/a nM
Citation Sasikumar, TKQiang, LBurnett, DAGreenlee, WJLi, CHeimark, LPramanik, BGrilli, MBertorelli, RLozza, GReggiani, A Tricyclic thienopyridine-pyrimidones/thienopyrimidine-pyrimidones as orally efficacious mGluR1 antagonists for neuropathic pain. Bioorg Med Chem Lett19:3199-203 (2009) 
 
Metabotropic glutamate receptor 1
Name:Metabotropic glutamate receptor 1
Type:Enzyme Catalytic Domain
Mol. Mass.:133240.47
Organism:RAT
Description:metabotropic glutamate 1/2 0 RAT::P23385
Residue:1199
BDBM50345948
NameBDBM50345948
Synonyms:9-Prop-2-ynylamino-3-p-tolyl-3H-pyrido[3',2':4,5]thieno[3,2-d]pyrimidin-4-one | CHEMBL1783875
TypeSmall organic molecule
Emp. Form.C19H14N4OS
Mol. Mass.346.406
SMILESCc1ccc(cc1)-n1cnc2c(sc3nccc(NCC#C)c23)c1=O