Reaction Details
TargetMetabotropic glutamate receptor 1
LigandBDBM50345930
Substrate/Competitorn/a
Meas. Tech.ChEMBL_749914 (CHEMBL1786744)
Ki 69±n/a nM
Citation Sasikumar, TKQiang, LBurnett, DAGreenlee, WJLi, CHeimark, LPramanik, BGrilli, MBertorelli, RLozza, GReggiani, A Tricyclic thienopyridine-pyrimidones/thienopyrimidine-pyrimidones as orally efficacious mGluR1 antagonists for neuropathic pain. Bioorg Med Chem Lett19:3199-203 (2009) 
 
Metabotropic glutamate receptor 1
Name:Metabotropic glutamate receptor 1
Type:Enzyme Catalytic Domain
Mol. Mass.:133240.47
Organism:RAT
Description:metabotropic glutamate 1/2 0 RAT::P23385
Residue:1199
BDBM50345930
NameBDBM50345930
Synonyms:3-Benzo[b]thiophen-5-yl-9-prop-2-ynylamino-3H-thieno[2,3-d:4,5-d']dipyrimidin-4-one | CHEMBL1784078
TypeSmall organic molecule
Emp. Form.C19H11N5OS2
Mol. Mass.389.454
SMILESO=c1n(cnc2c1sc1ncnc(NCC#C)c21)-c1ccc2sccc2c1