Reaction Details
TargetCarbonic anhydrase 2
LigandBDBM35730
Substrate/Competitorn/a
Meas. Tech.ChEMBL_750105 (CHEMBL1787522)
Ki 52±n/a nM
Citation Güzel, OInnocenti, AScozzafava, ASalman, ASupuran, CT Carbonic anhydrase inhibitors. Phenacetyl-, pyridylacetyl- and thienylacetyl-substituted aromatic sulfonamides act as potent and selective isoform VII inhibitors. Bioorg Med Chem Lett19:3170-3 (2009) 
 
Carbonic anhydrase 2
Name:Carbonic anhydrase 2
Type:Enzyme
Mol. Mass.:29250.71
Organism:Homo sapiens (Human)
Description:P00918
Residue:260
BDBM35730
NameBDBM35730
Synonyms:cid_694792 | sulfonamide deriv., 5e
TypeSmall organic molecule
Emp. Form.C13H14N2O3S2
Mol. Mass.310.392
SMILESNS(=O)(=O)c1ccc(CNC(=O)Cc2cccs2)cc1