Reaction Details
TargetcAMP-specific 3',5'-cyclic phosphodiesterase 4B
LigandBDBM50346116
Substrate/Competitorn/a
Meas. Tech.ChEMBL_750541 (CHEMBL1786302)
IC50 600±n/a nM
Citation Naganuma, KOmura, AMaekawara, NSaitoh, MOhkawa, NKubota, TNagumo, HKodama, TTakemura, MOhtsuka, YNakamura, JTsujita, RKawasaki, KYokoi, HKawanishi, M Discovery of selective PDE4B inhibitors. Bioorg Med Chem Lett19:3174-6 (2009) 
 
cAMP-specific 3',5'-cyclic phosphodiesterase 4B
Name:cAMP-specific 3',5'-cyclic phosphodiesterase 4B
Type:Protein
Mol. Mass.:83318.87
Organism:Homo sapiens (Human)
Description:Q07343
Residue:736
BDBM50346116
NameBDBM50346116
Synonyms:2-(4-(5-allyl-2-(4-methoxyphenyl)-6-methylpyrimidin-4-ylamino)phenyl)acetic acid | CHEMBL1782302
TypeSmall organic molecule
Emp. Form.C23H23N3O3
Mol. Mass.389.447
SMILESCOc1ccc(cc1)-c1nc(C)c(CC=C)c(Nc2ccc(CC(O)=O)cc2)n1