Reaction Details
TargetcAMP-specific 3',5'-cyclic phosphodiesterase 4B
LigandBDBM50346123
Substrate/Competitorn/a
Meas. Tech.ChEMBL_750541 (CHEMBL1786302)
IC50 15±n/a nM
Citation Naganuma, KOmura, AMaekawara, NSaitoh, MOhkawa, NKubota, TNagumo, HKodama, TTakemura, MOhtsuka, YNakamura, JTsujita, RKawasaki, KYokoi, HKawanishi, M Discovery of selective PDE4B inhibitors. Bioorg Med Chem Lett19:3174-6 (2009) 
 
cAMP-specific 3',5'-cyclic phosphodiesterase 4B
Name:cAMP-specific 3',5'-cyclic phosphodiesterase 4B
Type:Protein
Mol. Mass.:83318.87
Organism:Homo sapiens (Human)
Description:Q07343
Residue:736
BDBM50346123
NameBDBM50346123
Synonyms:2-(4-(5-ethyl-2-(5-fluorothiophen-2-yl)-6-methylpyrimidin-4-ylamino)-3-fluorophenyl)acetic acid | CHEMBL1782308
TypeSmall organic molecule
Emp. Form.C19H17F2N3O2S
Mol. Mass.389.419
SMILESCCc1c(C)nc(nc1Nc1ccc(CC(O)=O)cc1F)-c1ccc(F)s1