Reaction Details
TargetcAMP-specific 3',5'-cyclic phosphodiesterase 4D
LigandBDBM50346088
Substrate/Competitorn/a
Meas. Tech.ChEMBL_750542 (CHEMBL1786303)
IC50 27±n/a nM
Citation Naganuma, KOmura, AMaekawara, NSaitoh, MOhkawa, NKubota, TNagumo, HKodama, TTakemura, MOhtsuka, YNakamura, JTsujita, RKawasaki, KYokoi, HKawanishi, M Discovery of selective PDE4B inhibitors. Bioorg Med Chem Lett19:3174-6 (2009) 
 
cAMP-specific 3',5'-cyclic phosphodiesterase 4D
Name:cAMP-specific 3',5'-cyclic phosphodiesterase 4D
Type:Protein
Mol. Mass.:91092.69
Organism:Homo sapiens (Human)
Description:Q08499
Residue:809
BDBM50346088
NameBDBM50346088
Synonyms:(1r,4r)-4-cyano-4-(3-(cyclopentyloxy)-4-methoxyphenyl)cyclohexanecarboxylic acid 4-Cyano-4-(3-cyclopentyloxy-4-methoxy-phenyl)-cyclohexanecarboxylic acid 4-Cyano-4-(3-cyclopentyloxy-4-methoxy-phenyl)-cyclohexanecarboxylic acid methyl ester 6-(3,4-Dimethoxy-phenyl)-5-methyl-4,5-dihydro-2H-pyridazin-3-one CHEMBL511115 | SB-207499
TypeSmall organic molecule
Emp. Form.C20H25NO4
Mol. Mass.343.4168
SMILESCOc1ccc(cc1OC1CCCC1)[C@]1(CC[C@@H](CC1)C(O)=O)C#N