Reaction Details
TargetHistamine H3 receptor
LigandBDBM50139391
Substrate/Competitorn/a
Meas. Tech.ChEMBL_749354 (CHEMBL1785144)
Ki 0.45±n/a nM
Citation Swanson, DMShah, CRLord, BMorton, KDvorak, LKMazur, CApodaca, RXiao, WBoggs, JDFeinstein, MWilson, SJBarbier, AJBonaventure, PLovenberg, TWCarruthers, NI Heterocyclic replacement of the central phenyl core of diamine-based histamine H3 receptor antagonists. Eur J Med Chem44:4413-25 (2009) 
 
Histamine H3 receptor
Name:Histamine H3 receptor
Type:G Protein-Coupled Receptor (GPCR)
Mol. Mass.:48691.47
Organism:Homo sapiens (Human)
Description:Binding assays were using CHO cells stably expressing hH3R receptors.
Residue:445
BDBM50139391
NameBDBM50139391
Synonyms:(R)-4-(2-(2-(2-methylpyrrolidin-1-yl)ethyl)benzofuran-5-yl)benzonitrile ABT-239 | CHEMBL351231
TypeSmall organic molecule
Emp. Form.C22H22N2O
Mol. Mass.330.4229
SMILESC[C@@H]1CCCN1CCc1cc2cc(ccc2o1)-c1ccc(cc1)C#N