Reaction Details
TargetNeuropeptide Y receptor type 5
LigandBDBM50346231
Substrate/Competitorn/a
Meas. Tech.ChEMBL_749581 (CHEMBL1787190)
Ki 6.6±n/a nM
Citation Ando, MSato, NNagase, TNagai, KIshikawa, STakahashi, HOhtake, NIto, JHirayama, MMitobe, YIwaasa, HGomori, AMatsushita, HTadano, KFujino, NTanaka, SOhe, TIshihara, AKanatani, AFukami, T Discovery of pyridone-containing imidazolines as potent and selective inhibitors of neuropeptide Y Y5 receptor. Bioorg Med Chem17:6106-22 (2009) 
 
Neuropeptide Y receptor type 5
Name:Neuropeptide Y receptor type 5
Type:Enzyme
Mol. Mass.:50746.64
Organism:Homo sapiens (Human)
Description:Q15761
Residue:445
BDBM50346231
NameBDBM50346231
Synonyms:1-Ethyl-5-[(4S,5S)-4-(4-fluorophenyl)-4-(6-fluoropyridin-3-yl)-5-methyl-4,5-dihydro-1H-imidazol-2-yl]-3-methylpyridin-2(1H)-one | CHEMBL1784132
TypeSmall organic molecule
Emp. Form.C23H22F2N4O
Mol. Mass.408.4438
SMILESCCn1cc(cc(C)c1=O)C1=N[C@@]([C@H](C)N1)(c1ccc(F)cc1)c1ccc(F)nc1