Reaction Details
TargetNeuropeptide Y receptor type 5
LigandBDBM50249833
Substrate/Competitorn/a
Meas. Tech.ChEMBL_749581 (CHEMBL1787190)
Ki 1.4±n/a nM
Citation Ando, MSato, NNagase, TNagai, KIshikawa, STakahashi, HOhtake, NIto, JHirayama, MMitobe, YIwaasa, HGomori, AMatsushita, HTadano, KFujino, NTanaka, SOhe, TIshihara, AKanatani, AFukami, T Discovery of pyridone-containing imidazolines as potent and selective inhibitors of neuropeptide Y Y5 receptor. Bioorg Med Chem17:6106-22 (2009) 
 
Neuropeptide Y receptor type 5
Name:Neuropeptide Y receptor type 5
Type:Enzyme
Mol. Mass.:50746.64
Organism:Homo sapiens (Human)
Description:Q15761
Residue:445
BDBM50249833
NameBDBM50249833
Synonyms:6-[(4S,5S)-4-(4-Fluorophenyl)-4-(6-fluoro-3-pyridyl)-5-methyl-4,5-dihydro-1H-imidazol-2-yl]-2(1H)-pyridinone | CHEMBL489726
TypeSmall organic molecule
Emp. Form.C20H16F2N4O
Mol. Mass.366.364
SMILESC[C@@H]1NC(=N[C@@]1(c1ccc(F)cc1)c1ccc(F)nc1)c1cccc(=O)[nH]1