Reaction Details
Target3-hydroxy-3-methylglutaryl-coenzyme A reductase
LigandBDBM18425
Substrate/Competitorn/a
Meas. Tech.ChEMBL_750037 (CHEMBL1787314)
IC50 1±n/a nM
Citation Pfefferkorn, JALitchfield, JHutchings, RCheng, XMLarsen, SDAuerbach, BBush, MRLee, CErasga, NBowles, DMBoyles, DCLu, GSekerke, CAskew, VHanselman, JCDillon, LLin, ZRobertson, AOlsen, KBoustany, CAtkinson, KGoosen, TCSahasrabudhe, VChupka, JDuignan, DBFeng, BScialis, RKimoto, EBi, YALai, YEl-Kattan, ABakker-Arkema, RBarclay, PKindt, ELe, VMandema, JWMilad, MTait, BDKennedy, RTrivedi, BKKowala, M Discovery of novel hepatoselective HMG-CoA reductase inhibitors for treating hypercholesterolemia: a bench-to-bedside case study on tissue selective drug distribution. Bioorg Med Chem Lett21:2725-31 (2011) 
 
3-hydroxy-3-methylglutaryl-coenzyme A reductase
Name:3-hydroxy-3-methylglutaryl-coenzyme A reductase
Type:Enzyme
Mol. Mass.:96689.85
Organism:Rattus norvegicus (rat)
Description:Isolated rat liver microsomes were used as enzyme source.
Residue:887
BDBM18425
NameBDBM18425
Synonyms:(3R,5R)-7-[1-(4-fluorophenyl)-3-{[(4-methylphenyl)methyl]carbamoyl}-4-(propan-2-yl)-1H-pyrazol-5-yl]-3,5-dihydroxyheptanoic acid | pyrazole, 3f
TypeSmall organic molecule
Emp. Form.C28H34FN3O5
Mol. Mass.511.5851
SMILESCC(C)c1c(CC[C@@H](O)C[C@@H](O)CC(O)=O)n(nc1C(=O)NCc1ccc(C)cc1)-c1ccc(F)cc1