Reaction Details
Target3-hydroxy-3-methylglutaryl-coenzyme A reductase
LigandBDBM50346279
Substrate/Competitorn/a
Meas. Tech.ChEMBL_750037 (CHEMBL1787314)
IC50 1.7±n/a nM
Citation Pfefferkorn, JALitchfield, JHutchings, RCheng, XMLarsen, SDAuerbach, BBush, MRLee, CErasga, NBowles, DMBoyles, DCLu, GSekerke, CAskew, VHanselman, JCDillon, LLin, ZRobertson, AOlsen, KBoustany, CAtkinson, KGoosen, TCSahasrabudhe, VChupka, JDuignan, DBFeng, BScialis, RKimoto, EBi, YALai, YEl-Kattan, ABakker-Arkema, RBarclay, PKindt, ELe, VMandema, JWMilad, MTait, BDKennedy, RTrivedi, BKKowala, M Discovery of novel hepatoselective HMG-CoA reductase inhibitors for treating hypercholesterolemia: a bench-to-bedside case study on tissue selective drug distribution. Bioorg Med Chem Lett21:2725-31 (2011) 
 
3-hydroxy-3-methylglutaryl-coenzyme A reductase
Name:3-hydroxy-3-methylglutaryl-coenzyme A reductase
Type:Enzyme
Mol. Mass.:96689.85
Organism:Rattus norvegicus (rat)
Description:Isolated rat liver microsomes were used as enzyme source.
Residue:887
BDBM50346279
NameBDBM50346279
Synonyms:CHEMBL1782552 | sodium(3R,5R)-7-(5-cyclopropyl-2-(4-fluorophenyl)-4-(4-methylbenzylcarbamoyl)-1H-imidazol-1-yl)-3,5-dihydroxyheptanoate
TypeSmall organic molecule
Emp. Form.C28H31FN3O5
Mol. Mass.508.5618
SMILESCc1ccc(CNC(=O)c2nc(-c3ccc(F)cc3)n(CC[C@@H](O)C[C@@H](O)CC([O-])=O)c2C2CC2)cc1