Reaction Details
TargetFatty acid-binding protein, adipocyte
LigandBDBM50212873
Substrate/Competitorn/a
Meas. Tech.ChEMBL_751845 (CHEMBL1785600)
Ki 15±n/a nM
Citation Liu, XHuang, XLin, WWang, DDiao, YLi, HHui, XWang, YXu, AWu, DKe, D New aromatic substituted pyrazoles as selective inhibitors of human adipocyte fatty acid-binding protein. Bioorg Med Chem Lett21:2949-52 (2011) 
 
Fatty acid-binding protein, adipocyte
Name:Fatty acid-binding protein, adipocyte
Type:Enzyme
Mol. Mass.:14719.23
Organism:Homo sapiens (Human)
Description:P15090
Residue:132
BDBM50212873
NameBDBM50212873
Synonyms:((2'-(5-ETHYL-3,4-DIPHENYL-1H-PYRAZOL-1-YL)-3-BIPHENYLYL)OXY)ACETIC ACID CHEMBL247920 | [2'-(5-Ethyl-3,4-diphenyl-pyrazol-1-yl)-biphenyl-3-yloxy]-acetic acid
TypeSmall organic molecule
Emp. Form.C31H26N2O3
Mol. Mass.474.5497
SMILESCCc1c(c(nn1-c1ccccc1-c1cccc(OCC(O)=O)c1)-c1ccccc1)-c1ccccc1