Reaction Details
TargetCarbonic anhydrase 9
LigandBDBM10883
Substrate/Competitorn/a
Meas. Tech.ChEMBL_753460 (CHEMBL1799890)
Ki 50±n/a nM
Citation Rami, MMaresca, ASmaine, FZMontero, JLScozzafava, AWinum, JYSupuran, CT Sulfonamides incorporating boroxazolidone moieties are potent inhibitors of the transmembrane, tumor-associated carbonic anhydrase isoforms IX and XII. Bioorg Med Chem Lett21:2975-9 (2011) 
 
Carbonic anhydrase 9
Name:Carbonic anhydrase 9
Type:Enzyme
Mol. Mass.:49669.03
Organism:Homo sapiens (Human)
Description:Catalytic domain of human cloned isozyme was used in the assay
Residue:459
BDBM10883
NameBDBM10883
Synonyms:4,5-dichlorobenzene-1,3-disulfonamide Dichlorophenamide Dichlorophenamide, DCP US10172837, Dichlorphenamide | sulfonamide 4
TypeSmall organic molecule
Emp. Form.C6H6Cl2N2O4S2
Mol. Mass.305.159
SMILESNS(=O)(=O)c1cc(Cl)c(Cl)c(c1)S(N)(=O)=O