Reaction Details
TargetCarbonic anhydrase 1
LigandBDBM50346730
Substrate/Competitorn/a
Meas. Tech.ChEMBL_753459 (CHEMBL1799889)
Ki 3870±n/a nM
Citation Rami, MMaresca, ASmaine, FZMontero, JLScozzafava, AWinum, JYSupuran, CT Sulfonamides incorporating boroxazolidone moieties are potent inhibitors of the transmembrane, tumor-associated carbonic anhydrase isoforms IX and XII. Bioorg Med Chem Lett21:2975-9 (2011) 
 
Carbonic anhydrase 1
Name:Carbonic anhydrase 1
Type:Enzyme
Mol. Mass.:28873.37
Organism:Homo sapiens (Human)
Description:P00915
Residue:261
BDBM50346730
NameBDBM50346730
Synonyms:CHEMBL1797784
TypeSmall organic molecule
Emp. Form.C17H29BN4O4S2
Mol. Mass.428.378
SMILESCCB(CC)OC(=O)[C@@H](N)CCCCNC(=S)Nc1cccc(c1)S(N)(=O)=O