Reaction Details
TargetCarbonic anhydrase 1
LigandBDBM50346727
Substrate/Competitorn/a
Meas. Tech.ChEMBL_753459 (CHEMBL1799889)
Ki 6.8±n/a nM
Citation Rami, MMaresca, ASmaine, FZMontero, JLScozzafava, AWinum, JYSupuran, CT Sulfonamides incorporating boroxazolidone moieties are potent inhibitors of the transmembrane, tumor-associated carbonic anhydrase isoforms IX and XII. Bioorg Med Chem Lett21:2975-9 (2011) 
 
Carbonic anhydrase 1
Name:Carbonic anhydrase 1
Type:Enzyme
Mol. Mass.:28873.37
Organism:Homo sapiens (Human)
Description:P00915
Residue:261
BDBM50346727
NameBDBM50346727
Synonyms:CHEMBL1797791
TypeSmall organic molecule
Emp. Form.C25H38BN5O6S3
Mol. Mass.611.605
SMILESCCB(CC)OC(=O)[C@@H](N)CCCCNC(=S)Nc1ccc(cc1)S(=O)(=O)NCCc1ccc(cc1)S(N)(=O)=O