Reaction Details
TargetCarbonic anhydrase 9
LigandBDBM50346732
Substrate/Competitorn/a
Meas. Tech.ChEMBL_753460 (CHEMBL1799890)
Ki 9.5±n/a nM
Citation Rami, MMaresca, ASmaine, FZMontero, JLScozzafava, AWinum, JYSupuran, CT Sulfonamides incorporating boroxazolidone moieties are potent inhibitors of the transmembrane, tumor-associated carbonic anhydrase isoforms IX and XII. Bioorg Med Chem Lett21:2975-9 (2011) 
 
Carbonic anhydrase 9
Name:Carbonic anhydrase 9
Type:Enzyme
Mol. Mass.:49669.03
Organism:Homo sapiens (Human)
Description:Catalytic domain of human cloned isozyme was used in the assay
Residue:459
BDBM50346732
NameBDBM50346732
Synonyms:CHEMBL1797785
TypeSmall organic molecule
Emp. Form.C18H31BN4O4S2
Mol. Mass.442.404
SMILESCCB(CC)OC(=O)[C@@H](N)CCCCNC(=S)NCc1ccc(cc1)S(N)(=O)=O