Reaction Details
TargetCarbonic anhydrase 12
LigandBDBM50346731
Substrate/Competitorn/a
Meas. Tech.ChEMBL_753461 (CHEMBL1799891)
Ki 6.3±n/a nM
Citation Rami, MMaresca, ASmaine, FZMontero, JLScozzafava, AWinum, JYSupuran, CT Sulfonamides incorporating boroxazolidone moieties are potent inhibitors of the transmembrane, tumor-associated carbonic anhydrase isoforms IX and XII. Bioorg Med Chem Lett21:2975-9 (2011) 
 
Carbonic anhydrase 12
Name:Carbonic anhydrase 12
Type:Enzyme
Mol. Mass.:39456.00
Organism:Homo sapiens (Human)
Description:Catalytic domain of human cloned isozyme was used in the assay
Residue:354
BDBM50346731
NameBDBM50346731
Synonyms:CHEMBL1797786
TypeSmall organic molecule
Emp. Form.C19H33BN4O4S2
Mol. Mass.456.431
SMILESCCB(CC)OC(=O)[C@@H](N)CCCCNC(=S)NCCc1ccc(cc1)S(N)(=O)=O