Reaction Details
TargetCarbonic anhydrase 2
LigandBDBM50346726
Substrate/Competitorn/a
Meas. Tech.ChEMBL_753458 (CHEMBL1799888)
Ki 13.9±n/a nM
Citation Rami, MMaresca, ASmaine, FZMontero, JLScozzafava, AWinum, JYSupuran, CT Sulfonamides incorporating boroxazolidone moieties are potent inhibitors of the transmembrane, tumor-associated carbonic anhydrase isoforms IX and XII. Bioorg Med Chem Lett21:2975-9 (2011) 
 
Carbonic anhydrase 2
Name:Carbonic anhydrase 2
Type:Enzyme
Mol. Mass.:29250.71
Organism:Homo sapiens (Human)
Description:P00918
Residue:260
BDBM50346726
NameBDBM50346726
Synonyms:CHEMBL1797790
TypeSmall organic molecule
Emp. Form.C24H36BN5O6S3
Mol. Mass.597.579
SMILESCCB(CC)OC(=O)[C@@H](N)CCCCNC(=S)Nc1ccc(cc1)S(=O)(=O)NCc1ccc(cc1)S(N)(=O)=O