Reaction Details
TargetMatrix metalloproteinase-25
LigandBDBM50346798
Substrate/Competitorn/a
Meas. Tech.ChEMBL_753772 (CHEMBL1799653)
IC50 38±n/a nM
Citation Nuti, ECasalini, FSantamaria, SGabelloni, PBendinelli, SDa Pozzo, ECosta, BMarinelli, LLa Pietra, VNovellino, EMargarida Bernardo, MFridman, RDa Settimo, FMartini, CRossello, A Synthesis and biological evaluation in U87MG glioma cells of (ethynylthiophene)sulfonamido-based hydroxamates as matrix metalloproteinase inhibitors. Eur J Med Chem46:2617-29 (2011) 
 
Matrix metalloproteinase-25
Name:Matrix metalloproteinase-25
Type:Protein
Mol. Mass.:62564.84
Organism:Homo sapiens (Human)
Description:Q9NPA2
Residue:562
BDBM50346798
NameBDBM50346798
Synonyms:CHEMBL1795857
TypeSmall organic molecule
Emp. Form.C32H32N2O5S2
Mol. Mass.588.737
SMILESCCCCc1ccc(cc1)C#Cc1ccc(s1)S(=O)(=O)N[C@H](Cc1ccc(OCc2ccccc2)cc1)C(=O)NO