Reaction Details
TargetInterstitial collagenase
LigandBDBM50346800
Substrate/Competitorn/a
Meas. Tech.ChEMBL_753766 (CHEMBL1799647)
IC50 2300±n/a nM
Citation Nuti, ECasalini, FSantamaria, SGabelloni, PBendinelli, SDa Pozzo, ECosta, BMarinelli, LLa Pietra, VNovellino, EMargarida Bernardo, MFridman, RDa Settimo, FMartini, CRossello, A Synthesis and biological evaluation in U87MG glioma cells of (ethynylthiophene)sulfonamido-based hydroxamates as matrix metalloproteinase inhibitors. Eur J Med Chem46:2617-29 (2011) 
 
Interstitial collagenase
Name:Interstitial collagenase
Type:Enzyme
Mol. Mass.:54010.26
Organism:Homo sapiens (Human)
Description: P03956
Residue:469
BDBM50346800
NameBDBM50346800
Synonyms:CHEMBL1795859
TypeSmall organic molecule
Emp. Form.C27H27N3O4S2
Mol. Mass.521.651
SMILESCCCCc1ccc(cc1)C#Cc1ccc(s1)S(=O)(=O)N[C@H](Cc1c[nH]c2ccccc12)C(=O)NO