Reaction Details
Target72 kDa type IV collagenase
LigandBDBM50346800
Substrate/Competitorn/a
Meas. Tech.ChEMBL_753767 (CHEMBL1799648)
IC50 6±n/a nM
Citation Nuti, ECasalini, FSantamaria, SGabelloni, PBendinelli, SDa Pozzo, ECosta, BMarinelli, LLa Pietra, VNovellino, EMargarida Bernardo, MFridman, RDa Settimo, FMartini, CRossello, A Synthesis and biological evaluation in U87MG glioma cells of (ethynylthiophene)sulfonamido-based hydroxamates as matrix metalloproteinase inhibitors. Eur J Med Chem46:2617-29 (2011) 
 
72 kDa type IV collagenase
Name:72 kDa type IV collagenase
Type:Enzyme
Mol. Mass.:73870.36
Organism:Homo sapiens (Human)
Description: P08253
Residue:660
BDBM50346800
NameBDBM50346800
Synonyms:CHEMBL1795859
TypeSmall organic molecule
Emp. Form.C27H27N3O4S2
Mol. Mass.521.651
SMILESCCCCc1ccc(cc1)C#Cc1ccc(s1)S(=O)(=O)N[C@H](Cc1c[nH]c2ccccc12)C(=O)NO