Reaction Details
TargetStromelysin-1
LigandBDBM50346801
Substrate/Competitorn/a
Meas. Tech.ChEMBL_753768 (CHEMBL1799649)
IC50 320±n/a nM
Citation Nuti, ECasalini, FSantamaria, SGabelloni, PBendinelli, SDa Pozzo, ECosta, BMarinelli, LLa Pietra, VNovellino, EMargarida Bernardo, MFridman, RDa Settimo, FMartini, CRossello, A Synthesis and biological evaluation in U87MG glioma cells of (ethynylthiophene)sulfonamido-based hydroxamates as matrix metalloproteinase inhibitors. Eur J Med Chem46:2617-29 (2011) 
 
Stromelysin-1
Name:Stromelysin-1
Type:Enzyme
Mol. Mass.:53973.13
Organism:Homo sapiens (Human)
Description: P08254
Residue:477
BDBM50346801
NameBDBM50346801
Synonyms:CHEMBL1795860
TypeSmall organic molecule
Emp. Form.C27H26N2O4S3
Mol. Mass.538.701
SMILESCCCCc1ccc(cc1)C#Cc1ccc(s1)S(=O)(=O)N[C@H](Cc1csc2ccccc12)C(=O)NO