Reaction Details
TargetMatrix metalloproteinase-25
LigandBDBM50346802
Substrate/Competitorn/a
Meas. Tech.ChEMBL_753772 (CHEMBL1799653)
IC50 170±n/a nM
Citation Nuti, ECasalini, FSantamaria, SGabelloni, PBendinelli, SDa Pozzo, ECosta, BMarinelli, LLa Pietra, VNovellino, EMargarida Bernardo, MFridman, RDa Settimo, FMartini, CRossello, A Synthesis and biological evaluation in U87MG glioma cells of (ethynylthiophene)sulfonamido-based hydroxamates as matrix metalloproteinase inhibitors. Eur J Med Chem46:2617-29 (2011) 
 
Matrix metalloproteinase-25
Name:Matrix metalloproteinase-25
Type:Protein
Mol. Mass.:62564.84
Organism:Homo sapiens (Human)
Description:Q9NPA2
Residue:562
BDBM50346802
NameBDBM50346802
Synonyms:CHEMBL1795861
TypeSmall organic molecule
Emp. Form.C20H22N2O4S3
Mol. Mass.450.595
SMILESCCCCc1ccc(cc1)C#Cc1ccc(s1)S(=O)(=O)N1CSC[C@H]1C(=O)NO