Reaction Details
TargetLysine-specific demethylase 4E
LigandBDBM81348
Substrate/Competitorn/a
Meas. Tech.ChEMBL_754092 (CHEMBL1798570)
IC50 3000±n/a nM
Citation Lohse, BKristensen, JLKristensen, LHAgger, KHelin, KGajhede, MClausen, RP Inhibitors of histone demethylases. Bioorg Med Chem19:3625-36 (2011) 
 
Lysine-specific demethylase 4E
Name:Lysine-specific demethylase 4E
Type:Enzyme
Mol. Mass.:56815.71
Organism:Homo sapiens (Human)
Description:B2RXH2
Residue:506
BDBM81348
NameBDBM81348
Synonyms:β-Lapachone (A3) R115 (Reactive Blue 2) | beta-Lapachone
TypeSmall organic molecule
Emp. Form.C15H14O3
Mol. Mass.242.2699
SMILESCC1(C)CCC2=C(O1)c1ccccc1C(=O)C2=O