Reaction Details
TargetLysine-specific demethylase 4E
LigandBDBM19149
Substrate/Competitorn/a
Meas. Tech.ChEMBL_754091 (CHEMBL1798569)
IC50 14000±n/a nM
Citation Lohse, BKristensen, JLKristensen, LHAgger, KHelin, KGajhede, MClausen, RP Inhibitors of histone demethylases. Bioorg Med Chem19:3625-36 (2011) 
 
Lysine-specific demethylase 4E
Name:Lysine-specific demethylase 4E
Type:Enzyme
Mol. Mass.:56815.71
Organism:Homo sapiens (Human)
Description:B2RXH2
Residue:506
BDBM19149
NameBDBM19149
Synonyms:CHEMBL98 SAHA US10188756, Compound SAHA US11505523, Compound SAHA US9353061, SAHA US9695181, Vorinostat Zolinza suberoylanilide hydroxamic acid
TypeSmall organic molecule
Emp. Form.C14H20N2O3
Mol. Mass.264.3202
SMILESONC(=O)CCCCCCC(=O)Nc1ccccc1