Reaction Details
TargetLysine-specific demethylase 4E
LigandBDBM50346879
Substrate/Competitorn/a
Meas. Tech.ChEMBL_754090 (CHEMBL1798568)
IC50 200000±n/a nM
Citation Lohse, BKristensen, JLKristensen, LHAgger, KHelin, KGajhede, MClausen, RP Inhibitors of histone demethylases. Bioorg Med Chem19:3625-36 (2011) 
 
Lysine-specific demethylase 4E
Name:Lysine-specific demethylase 4E
Type:Enzyme
Mol. Mass.:56815.71
Organism:Homo sapiens (Human)
Description:B2RXH2
Residue:506
BDBM50346879
NameBDBM50346879
Synonyms:CHEMBL1797656
TypeSmall organic molecule
Emp. Form.C12H13NO5S
Mol. Mass.283.3
SMILESOC(=O)[C@@H](CSCc1ccccc1)NC(=O)C(O)=O