Reaction Details
TargetEndoglucanase-5
LigandBDBM50346887
Substrate/Competitorn/a
Meas. Tech.ChEMBL_754100 (CHEMBL1798578)
pH3±n/a
Ki 1600000±n/a nM
Commentsextracted
Citation Noguchi, STakemoto, SKidokoro, SYamamoto, KHashimoto, M Syntheses of cellotriose and cellotetraose analogues as transition state mimics for mechanistic studies of cellulases. Bioorg Med Chem19:3812-30 (2011) 
 
Endoglucanase-5
Name:Endoglucanase-5
Type:PROTEIN
Mol. Mass.:22862.67
Organism:Humicola insolens
Description:ChEMBL_754101
Residue:213
BDBM50346887
NameBDBM50346887
Synonyms:CHEMBL1797814
TypeSmall organic molecule
Emp. Form.C26H44O19S
Mol. Mass.692.681
SMILESCO[C@@H]1O[C@H](CO)[C@@H](O[C@@H]2O[C@H](CO)[C@@H](S[C@@H]3C=C(CO)[C@@H](O[C@@H]4O[C@H](CO)[C@@H](O)[C@H](O)[C@H]4O)[C@H](O)[C@H]3O)[C@H](O)[C@H]2O)[C@H](O)[C@H]1O