Reaction Details
TargetEndoglucanase-5
LigandBDBM50346888
Substrate/Competitorn/a
Meas. Tech.ChEMBL_754101 (CHEMBL1798579)
pH4±n/a
Ki 420000±n/a nM
Commentsextracted
Citation Noguchi, STakemoto, SKidokoro, SYamamoto, KHashimoto, M Syntheses of cellotriose and cellotetraose analogues as transition state mimics for mechanistic studies of cellulases. Bioorg Med Chem19:3812-30 (2011) 
 
Endoglucanase-5
Name:Endoglucanase-5
Type:PROTEIN
Mol. Mass.:22862.67
Organism:Humicola insolens
Description:ChEMBL_754101
Residue:213
BDBM50346888
NameBDBM50346888
Synonyms:CHEMBL1797815
TypeSmall organic molecule
Emp. Form.C36H62O31
Mol. Mass.990.8589
SMILESOC[C@@H](O)[C@@H](O[C@@H]1O[C@H](CO)[C@@H](O[C@@H]2O[C@H](CO)[C@@H](O[C@@H]3O[C@H](CO)[C@@H](O[C@@H]4O[C@H](CO)[C@@H](O[C@@H]5O[C@H](CO)[C@@H](O)[C@H](O)[C@H]5O)[C@H](O)[C@H]4O)[C@H](O)[C@H]3O)[C@H](O)[C@H]2O)[C@H](O)[C@H]1O)[C@H](O)[C@@H](O)C=O