Reaction Details
TargetSerine/threonine-protein kinase mTOR
LigandBDBM50346965
Substrate/Competitorn/a
Meas. Tech.ChEMBL_753273 (CHEMBL1799484)
EC50 20±n/a nM
Citation Liu, QWang, JKang, SAThoreen, CCHur, WChoi, HGWaller, DLSim, TSabatini, DMGray, NS Discovery and optimization of potent and selective benzonaphthyridinone analogs as small molecule mTOR inhibitors with improved mouse microsome stability. Bioorg Med Chem Lett21:4036-40 (2011) 
 
Serine/threonine-protein kinase mTOR
Name:Serine/threonine-protein kinase mTOR
Type:Enzyme
Mol. Mass.:288814.44
Organism:Mus musculus (Mouse)
Description:Q9JLN9
Residue:2549
BDBM50346965
NameBDBM50346965
Synonyms:CHEMBL1795879
TypeSmall organic molecule
Emp. Form.C35H20F3N3O3
Mol. Mass.587.5468
SMILESOC(=O)c1ccc(cc1)-c1ccc(cc1C(F)(F)F)-n1c2c(ccc1=O)cnc1ccc(cc21)-c1cnc2ccccc2c1