Reaction Details
TargetRenin
LigandBDBM50346994
Substrate/Competitorn/a
Meas. Tech.ChEMBL_753403 (CHEMBL1799738)
IC50 2.2±n/a nM
Citation Chen, ACampeau, LCCauchon, EChefson, ADucharme, YDubé, DFalgueyret, JPFournier, PAGagné, SGrimm, EHan, YHoule, RHuang, JQLacombe, PLaliberté, SLévesque, JFLiu, SMacDonald, DMackay, BMcKay, DPercival, MDRegan, CRegan, HSt-Jacques, RToulmond, S Renin inhibitors for the treatment of hypertension: design and optimization of a novel series of pyridone-substituted piperidines. Bioorg Med Chem Lett21:3970-5 (2011) 
 
Renin
Name:Renin
Type:Enzyme
Mol. Mass.:45058.99
Organism:Homo sapiens (Human)
Description:n/a
Residue:406
BDBM50346994
NameBDBM50346994
Synonyms:CHEMBL1795912
TypeSmall organic molecule
Emp. Form.C25H31Cl2N3O3
Mol. Mass.492.438
SMILESCOCCc1cc(Cl)c(Cl)c(CN(C2CC2)C(=O)[C@H]2CNCC[C@@H]2c2ccn(C)c(=O)c2)c1