Reaction Details
TargetInsulin receptor-related protein
LigandBDBM50347388
Substrate/Competitorn/a
Meas. Tech.ChEMBL_754586 (CHEMBL1806289)
IC50 1800±n/a nM
Citation Heathcote, DAPatel, HKroll, SHHazel, PPeriyasamy, MAlikian, MKanneganti, SKJogalekar, ASScheiper, BBarbazanges, MBlum, ABrackow, JSiwicka, APace, RDFuchter, MJSnyder, JPLiotta, DCFreemont, PSAboagye, EOCoombes, RCBarrett, AGAli, S A novel pyrazolo[1,5-a]pyrimidine is a potent inhibitor of cyclin-dependent protein kinases 1, 2, and 9, which demonstrates antitumor effects in human tumor xenografts following oral administration. J Med Chem53:8508-22 (2010) 
 
Insulin receptor-related protein
Name:Insulin receptor-related protein
Type:PROTEIN
Mol. Mass.:143716.96
Organism:Homo sapiens (Human)
Description:ChEMBL_774555
Residue:1297
BDBM50347388
NameBDBM50347388
Synonyms:CHEMBL1234833
TypeSmall organic molecule
Emp. Form.C20H27N5O3
Mol. Mass.385.4601
SMILESCC(C)c1cnn2c(NCc3ccccc3)cc(N[C@@H](CO)[C@H](O)CO)nc12