Reaction Details
TargetP2Y purinoceptor 11
LigandBDBM50347445
Substrate/Competitorn/a
Meas. Tech.ChEMBL_755242 (CHEMBL1806221)
EC50 13000±n/a nM
Citation Eliahu, SLecka, JReiser, GHaas, MBigonnesse, FLévesque, SAPelletier, JSévigny, JFischer, B Diadenosine 5',5''-(boranated)polyphosphonate analogues as selective nucleotide pyrophosphatase/phosphodiesterase inhibitors. J Med Chem53:8485-97 (2010) 
 
P2Y purinoceptor 11
Name:P2Y purinoceptor 11
Type:PROTEIN
Mol. Mass.:40366.02
Organism:Homo sapiens (Human)
Description:ChEMBL_1362532
Residue:374
BDBM50347445
NameBDBM50347445
Synonyms:CHEMBL1802094
TypeSmall organic molecule
Emp. Form.C22H31BN10O19P5
Mol. Mass.905.22
SMILES[BH3-]P(=O)(OP([O-])(=O)CP([O-])(=O)OC[C@H]1O[C@H]([C@H](O)[C@@H]1O)n1cnc2c(N)ncnc12)OP([O-])(=O)CP([O-])(=O)OC[C@H]1O[C@H]([C@H](O)[C@@H]1O)n1cnc2c(N)ncnc12