Reaction Details
TargetIndoleamine 2,3-dioxygenase 1
LigandBDBM50336434
Substrate/Competitorn/a
Meas. Tech.ChEMBL_754732 (CHEMBL1805587)
Ki 190000±n/a nM
Citation Dolušic, ELarrieu, PBlanc, SSapunaric, FPouyez, JMoineaux, LColette, DStroobant, VPilotte, LColau, DFerain, TFraser, GGalleni, MFrère, JMMasereel, BVan den Eynde, BWouters, JFrédérick, R Discovery and preliminary SARs of keto-indoles as novel indoleamine 2,3-dioxygenase (IDO) inhibitors. Eur J Med Chem46:3058-65 (2011) 
 
Indoleamine 2,3-dioxygenase 1
Name:Indoleamine 2,3-dioxygenase 1
Type:Enzyme
Mol. Mass.:45330.80
Organism:Homo sapiens (Human)
Description:P14902
Residue:403
BDBM50336434
NameBDBM50336434
Synonyms:1-(1H-Indol-2-yl)-2-pyridin-3-yl-ethanone | CHEMBL1668301
TypeSmall organic molecule
Emp. Form.C15H12N2O
Mol. Mass.236.2686
SMILESO=C(Cc1cccnc1)c1cc2ccccc2[nH]1