Reaction Details
TargetTranscription factor p65
LigandBDBM50196926
Substrate/Competitorn/a
Meas. Tech.ChEMBL_756042 (CHEMBL1804152)
IC50 75±n/a nM
Citation Ayers, SGraf, TNAdcock, AFKroll, DJMatthew, SCarcache de Blanco, EJShen, QSwanson, SMWani, MCPearce, CJOberlies, NH Resorcylic acid lactones with cytotoxic and NF-¿B inhibitory activities and their structure-activity relationships. J Nat Prod74:1126-31 (2011) 
 
Transcription factor p65
Name:Transcription factor p65
Type:Enzyme
Mol. Mass.:60211.92
Organism:Homo sapiens (Human)
Description:Q04206
Residue:551
BDBM50196926
NameBDBM50196926
Synonyms:CHEMBL438139 US10085988, Compound (-) Roc-A
TypeSmall organic molecule
Emp. Form.C29H31NO7
Mol. Mass.505.5589
SMILESCOc1ccc(cc1)[C@@]12Oc3cc(OC)cc(OC)c3[C@]1(O)[C@H](O)[C@@H]([C@H]2c1ccccc1)C(=O)N(C)C