Reaction Details
TargetD(2) dopamine receptor
LigandBDBM50347558
Substrate/Competitorn/a
Meas. Tech.ChEMBL_756832 (CHEMBL1803156)
Ki 9.6±n/a nM
Citation Reinart, RGyulai, ZBerényi, SAntus, SVonk, ARinken, ASipos, A New 2-thioether-substituted apomorphines as potent and selective dopamine D2 receptor agonists. Eur J Med Chem46:2992-9 (2011) 
 
D(2) dopamine receptor
Name:D(2) dopamine receptor
Type:G Protein-Coupled Receptor (GPCR)
Mol. Mass.:50931.60
Organism:Rattus norvegicus (rat)
Description:P61169
Residue:444
BDBM50347558
NameBDBM50347558
Synonyms:CHEMBL1802233
TypeSmall organic molecule
Emp. Form.C19H22N2O2S
Mol. Mass.342.455
SMILESCN1CCc2cc(SCCN)cc-3c2[C@H]1Cc1ccc(O)c(O)c-31