Reaction Details
TargetCarbonic anhydrase 1
LigandBDBM50031472
Substrate/Competitorn/a
Meas. Tech.ChEMBL_757505 (CHEMBL1804477)
Ki 7410±n/a nM
Citation Oztürk Sarikaya, SBTopal, FSentürk, MGülçin, ISupuran, CT In vitro inhibition ofa-carbonic anhydrase isozymes by some phenolic compounds. Bioorg Med Chem Lett21:4259-62 (2011) 
 
Carbonic anhydrase 1
Name:Carbonic anhydrase 1
Type:Enzyme
Mol. Mass.:28873.37
Organism:Homo sapiens (Human)
Description:P00915
Residue:261
BDBM50031472
NameBDBM50031472
Synonyms:1,2,3-Trihydroxybenzene, XIV Pyrogallol (10) pyrogallol
TypeSmall organic molecule
Emp. Form.C6H6O3
Mol. Mass.126.11
SMILESOc1cccc(O)c1O