Reaction Details
TargetCarbonic anhydrase
LigandBDBM26194
Substrate/Competitorn/a
Meas. Tech.ChEMBL_757508 (CHEMBL1804480)
Ki 8460±n/a nM
Citation Oztürk Sarikaya, SBTopal, FSentürk, MGülçin, ISupuran, CT In vitro inhibition ofa-carbonic anhydrase isozymes by some phenolic compounds. Bioorg Med Chem Lett21:4259-62 (2011) 
 
Carbonic anhydrase
Name:Carbonic anhydrase
Synonyms:n/a
Type:PROTEIN
Mol. Mass.:32973.15
Organism:Dicentrarchus labrax
Description:ChEMBL_757508
Residue:309
BDBM26194
NameBDBM26194
TypeSmall organic molecule
Emp. Form.C7H6O3
Mol. Mass.138.1207
SMILESOC(=O)c1ccc(O)cc1