Reaction Details
TargetCarbonic anhydrase
LigandBDBM50336490
Substrate/Competitorn/a
Meas. Tech.ChEMBL_757508 (CHEMBL1804480)
Ki 2130±n/a nM
Citation Oztürk Sarikaya, SBTopal, FSentürk, MGülçin, ISupuran, CT In vitro inhibition ofa-carbonic anhydrase isozymes by some phenolic compounds. Bioorg Med Chem Lett21:4259-62 (2011) 
 
Carbonic anhydrase
Name:Carbonic anhydrase
Synonyms:n/a
Type:PROTEIN
Mol. Mass.:32973.15
Organism:Dicentrarchus labrax
Description:ChEMBL_757508
Residue:309
BDBM50336490
NameBDBM50336490
TypeSmall organic molecule
Emp. Form.C7H6O4
Mol. Mass.154.1201
SMILESOC(=O)c1cc(O)cc(O)c1