Reaction Details
TargetCannabinoid receptor 2
LigandBDBM26144
Substrate/Competitorn/a
Meas. Tech.ChEMBL_757148 (CHEMBL1803288)
Ki 1300±n/a nM
Citation Martín-Couce, LMartín-Fontecha, MCapolicchio, SLópez-Rodríguez, MLOrtega-Gutiérrez, S Development of endocannabinoid-based chemical probes for the study of cannabinoid receptors. J Med Chem54:5265-9 (2011) 
 
Cannabinoid receptor 2
Name:Cannabinoid receptor 2
Type:G Protein-Coupled Receptor (GPCR)
Mol. Mass.:39690.94
Organism:Homo sapiens (Human)
Description:P34972
Residue:360
BDBM26144
NameBDBM26144
Synonyms:1,3-dihydroxypropan-2-yl (5Z,8Z,11Z,14Z)-icosa-5,8,11,14-tetraenoate 2-arachidonoylglycerol (2-AG) CHEMBL122972
TypeEndocannabinoids
Emp. Form.C23H38O4
Mol. Mass.378.5454
SMILESCCCCC\C=C/C\C=C/C\C=C/C\C=C/CCCC(=O)OC(CO)CO