Reaction Details
TargetAdenosine receptor A3
LigandBDBM50348163
Substrate/Competitorn/a
Meas. Tech.ChEMBL_757185 (CHEMBL1803409)
Ki 1.93±n/a nM
Citation Baraldi, PGPreti, DZaid, ANSaponaro, GTabrizi, MABaraldi, SRomagnoli, RMoorman, ARVarani, KCosconati, SDi Maro, SMarinelli, LNovellino, EBorea, PA New 2-heterocyclyl-imidazo[2,1-i]purin-5-one derivatives as potent and selective human A3 adenosine receptor antagonists. J Med Chem54:5205-20 (2011) 
 
Adenosine receptor A3
Name:Adenosine receptor A3
Type:G Protein-Coupled Receptor (GPCR)
Mol. Mass.:36197.32
Organism:Homo sapiens (Human)
Description:P0DMS8
Residue:318
BDBM50348163
NameBDBM50348163
Synonyms:CHEMBL1800862
TypeSmall organic molecule
Emp. Form.C16H18N6O3
Mol. Mass.342.3525
SMILESCCC1Cn2c(N1)c1nc(nc1n(CC=C)c2=O)-c1cc(OC)no1