Reaction Details
TargetAdenosine receptor A3
LigandBDBM50348155
Substrate/Competitorn/a
Meas. Tech.ChEMBL_757182 (CHEMBL1803406)
IC50 10.5±n/a nM
Citation Baraldi, PGPreti, DZaid, ANSaponaro, GTabrizi, MABaraldi, SRomagnoli, RMoorman, ARVarani, KCosconati, SDi Maro, SMarinelli, LNovellino, EBorea, PA New 2-heterocyclyl-imidazo[2,1-i]purin-5-one derivatives as potent and selective human A3 adenosine receptor antagonists. J Med Chem54:5205-20 (2011) 
 
Adenosine receptor A3
Name:Adenosine receptor A3
Type:G Protein-Coupled Receptor (GPCR)
Mol. Mass.:36197.32
Organism:Homo sapiens (Human)
Description:P0DMS8
Residue:318
BDBM50348155
NameBDBM50348155
Synonyms:CHEMBL1800784
TypeSmall organic molecule
Emp. Form.C17H21N7O2
Mol. Mass.355.3943
SMILESCC[C@H]1Cn2c(N1)c1nc(nc1n(CC=C)c2=O)-c1cc(OC)nn1C