Reaction Details
TargetBeta-2 adrenergic receptor
LigandBDBM50348427
Substrate/Competitorn/a
Meas. Tech.ChEMBL_755355 (CHEMBL1804511)
EC50 17±n/a nM
Citation Jozwiak, KWoo, AYTanga, MJToll, LJimenez, LKozocas, JAPlazinska, AXiao, RPWainer, IW Comparative molecular field analysis of fenoterol derivatives: A platform towards highly selective and effective beta(2)-adrenergic receptor agonists. Bioorg Med Chem18:728-36 (2010) 
 
Beta-2 adrenergic receptor
Name:Beta-2 adrenergic receptor
Type:n/a
Mol. Mass.:46461.69
Organism:Homo sapiens (Human)
Description:P07550
Residue:413
BDBM50348427
NameBDBM50348427
Synonyms:CHEMBL1800960 | US9492405, 49
TypeSmall organic molecule
Emp. Form.C18H23NO4
Mol. Mass.317.3795
SMILESCC[C@@H](Cc1ccc(O)cc1)NC[C@H](O)c1cc(O)cc(O)c1